Missouri Circuit Court - Oregon County
type: Class
subclass of: RDECjssxw76vdlahxiUTb4L
definition: Missouri Circuit Court - Oregon County is a specific court within the Missouri Circuit Court system that has jurisdiction over legal matters within Oregon County.