Saint Paul Charlestown
type: Class
alternative label: KN+10
subclass of: RDE9b062380bd287575D2c56
hidden label: KN+10
definition: Saint Paul Charlestown is a specific location within the country of Saint Kitts and Nevis.