Balance Sheet
type: Class
alternative label: 资产负债表
subclass of: R8zijLH2GH0SxOhIdzeDOs3
definition: A balance sheet is a financial statement that shows a company's assets, liabilities, and equity at a specific point in time, and is used to assess the financial health of the company.