Icelandic
type: Class
alternative label: 冰岛语
subclass of: RDOvAHsvY8TKJ1O1orXPM9o
definition: Icelandic (Language) is a structured system of communication consisting of grammar and vocabulary used in Iceland and by Icelandic speakers.