Irish, Old
type: Class
alternative label: 古爱尔兰语
subclass of: RDOvAHsvY8TKJ1O1orXPM9o
definition: Old Irish (to 900) is a form of structured communication system, consisting of grammar and vocabulary, used in Ireland before the year 900.