U.S. Library of Congress
type: Class
preferred label: Library of Congress
alternative label: 美国国会图书馆
subclass of: R22815eC3Af3bFF0d002Ca58
hidden label: LOC
definition: The Library of Congress (LOC) is the research library that officially serves the United States Congress and is the de facto national library of the United States.