dctermsAgent
type: Class
subclass of: RG06B87qkXrj4iQBwonhRb
definition: dctermsAgent refers to an actor or entity responsible for creating or contributing to a resource, as defined by the Dublin Core Metadata Initiative.