Not for Distribution Clause
type: Class
alternative label: 不得分发条款
subclass of: RDe0RKU39BlhcyACJW30ZLc
definition: A Not for Distribution Clause is a provision in a contract that prohibits the recipient from sharing or disseminating the information or materials provided to them.