Frequently Asked Questions
type: Class
alternative label: 常见问题
subclass of: RTPFix1eiYqgdushRunICo
definition: A document that provides answers to a list of typical questions that users might ask regarding a particular subject (e.g., legal processes, substantive legal topics).