California Court of Appeal - 3d Dist.
type: Class
subclass of: RDE31b2AF49a59EE24276760
definition: The California Court of Appeal - 3d Dist. is a specific division of the California Court of Appeal that hears appeals from trial courts in the third appellate district of California.