Nondelegable Duty
type: Class
alternative label: 不可委托职责
subclass of: RCGW5RFfjJ95ygeSCJLaJQT
definition: A nondelegable duty is a legal obligation that cannot be transferred or assigned to another party, even if that party is an agent or representative of the original party.