Special Master
type: Class
preferred label: Court-Appointed Neutral
alternative label: 特别大师
subclass of: RDSYPGgBlFz5eWNtwoMA2c5
definition: An independent person usually appointed by a judge or judicial body to exercise certain powers, as defined by that judge or judicial body.