Low German; Low Saxon; German, Low; Saxon, Low
type: Class
alternative label: 低地德语; 低地撒克逊语; 德语，低地; 撒克逊语，低地
subclass of: RDOvAHsvY8TKJ1O1orXPM9o
definition: A West Germanic language spoken mainly in Northern Germany and the eastern part of the Netherlands, characterized by its low pitch and stress accent; often used in legal documents and proceedings in the regions where it is spoken.