Student Housing - Real Estate Asset
type: Class
alternative label: 学生住房 - 房地产资产
subclass of: RUhSbbDJZa8Crs3tIWcIfV
definition: Student Housing - Real Estate Asset: A type of real estate asset that is specifically designed and used for student housing purposes.