Minnesota District Court - Benton County
type: Class
subclass of: RxLV9XEaDWbDIA8N1fl2fM
definition: Minnesota District Court - Benton County: A specific court within the Minnesota District Court system that has jurisdiction over legal matters within Benton County.