Incarceration for Time Served
type: Class
alternative label: 已服刑入狱
subclass of: R8ItOPdbcc8mA2sYecRl3cu
definition: The concept of "Incarceration for Time Served" refers to the legal practice of releasing a prisoner from custody after they have served the full length of their sentence, including any time spent in pre-trial detention or custody.