State Department Office of the Inspector General
type: Class
alternative label: 国务院审计长办公室
subclass of: R0480ee8B57a1441863FE362
hidden label: STATEOIG
definition: The State Department Office of the Inspector General (OIG) inspects more than 260 embassies, diplomatic posts, and international broadcasting installations throughout the world to determine whether policy goals are being achieved and whether the interests of the United States are being represented and advanced effectively. Additionally, OIG performs specialized security inspections and audits in support of the Department's mission to provide effective protection to our personnel, facilities, and sensitive information.