Cybersecurity Law
type: Class
alternative label: 网络安全法
subclass of: R7kUD6H5adQ83mCKuHjT5JD
hidden label: CYBR
definition: Law and rules related to the protection of information and information systems.