Business Schools and Computer and Management Training Industry
type: Class
alternative label: 商学院和管理培训行业
subclass of: RB7IaNyshrHiqug0LlmK6J2
hidden label: BSCH
definition: This industry group comprises establishments primarily engaged in one of the following: (1) offering courses in office procedures and secretarial and stenographic skills and may offer courses in basic office skills, such as word processing; (2) conducting computer training (except computer repair); or (3) offering an array of short duration courses and seminars for management and professional development. Instruction may be provided in diverse settings, such as the establishment's or client's training facilities, educational institutions, the workplace, or the home, and through diverse means, such as correspondence, television, the Internet, or other electronic and distance-learning methods. The training provided by these establishments may include the use of simulators and simulation methods.