Military Deployment
type: Class
subclass of: RC8JmK2y8Na9Itkk0MCtMS4
definition: Military deployment refers to the movement of armed forces and their logistical support infrastructure to a specific location or theater of operations. It can be in response to an international crisis, as part of routine exercises, or for other strategic purposes.