Canada Variants
type: Class
subclass of: R8zL0uhEOQuxBZcdYyS8ORn
definition: Canada Variants refers to a collection of specific legal areas within Canadian law, including Employment Law, Condominium Law, Municipal Law, Disability Insurance Law, Custody Law, Accident Benefits Law, Pay Equity Law, Private Equity, Franchise Law, Employment Contracts Law, Independent Contractor Law, Private Equity, Hedge Funds and Venture Capital Law.