Missouri Circuit Court - Putnam County
type: Class
subclass of: RDECjssxw76vdlahxiUTb4L
definition: A Missouri Circuit Court in Putnam County is a specific court within the Missouri Circuit Court system that has jurisdiction over legal matters within Putnam County, Missouri.