Data Format
type: Class
alternative label: 数据格式
subclass of: Thing
definition: The data structure that gives the file its meaning; in the context of legal data, the format of the legal-data file (e.g., Microsoft Word Document, Adobe Acrobat PDF, Microsoft Excel file).