Subcontracting Clause
type: Class
alternative label: 分包条款
subclass of: RDe0RKU39BlhcyACJW30ZLc
definition: A Subcontracting Clause is a provision in a contract that allows one party to hire another party to perform some or all of the work outlined in the original contract.