DEPRECATED Matter Identifier, in favor of `Matter ID` https://folio.openlegalstandard.org/RUgWyAVlkn9ysIUzCG1Ahb
type: Class
subclass of: R8H8cpx25KBk3kH55YwSdDv
definition: Matter identifier (e.g., IRIs, UUIDs, GUIDs) within the systems of stakeholders (e.g., vendors, sellers, buyers, courts).