Event Cancelled
type: Class
alternative label: 活动取消
subclass of: Rs2T4JXRBzxyj3hNAMRsoT
definition: The concept of "Event Cancelled" refers to the status of an event that has been called off or terminated before its scheduled occurrence.