Temporary Restraining Order
type: Class
alternative label: 临时限制令
subclass of: R9rhwkH0GU868poYsoFKzVb
subclass of: RFXc2NtinmfJhHDBnbVgVN
definition: A Temporary Restraining Order (TRO) is a provisional legal remedy that prohibits a party from taking certain actions until a court can make a final decision on the matter.