Nandi
type: Class
alternative label: KE+32
subclass of: R888ccd914a7eAC7d68FC0db
hidden label: KE+32
definition: Nandi refers to a specific location in Kenya, which is a political subdivision within the country.