Bulambuli
type: Class
alternative label: UG+225
subclass of: R8680cbB69cf63001936Bffe
hidden label: UG+225
definition: Bulambuli refers to a specific location within Uganda, which is a country in East Africa.