U.S. Central Intelligence Agency
type: Class
preferred label: Central Intelligence Agency
alternative label: 美国中央情报局
subclass of: R22815eC3Af3bFF0d002Ca58
hidden label: CIA
definition: The Central Intelligence Agency (CIA) is a civilian foreign intelligence service of the Federal government of the United States, tasked with gathering, processing, and analyzing national security information from around the world, primarily through the use of human intelligence (HUMINT).