Maine State Courts
type: Class
alternative label: ME
subclass of: R1F4dbe4CD17b3B2a7f15b97
hidden label: ME
definition: Maine State Courts are the judicial system of the state of Maine, consisting of the Maine Superior Court and the Maine Supreme Court.