National Security Agency
type: Class
alternative label: 国家安全局
subclass of: RF52f1c417a596A01b36Bcf0
hidden label: NSA
definition: The National Security Agency (NSA) is a national-level intelligence agency of the United States Department of Defense, under the authority of the Director of National Intelligence.