Ohio State Courts
type: Class
alternative label: OH
subclass of: R1F4dbe4CD17b3B2a7f15b97
hidden label: OH
definition: Ohio State Courts are the judicial bodies responsible for interpreting and enforcing the laws of the state of Ohio.