Ghat
type: Class
alternative label: LY+GT
subclass of: R8A71840AEaf07AEe391C599
hidden label: LY+GT
definition: A ghat is a specific location in Libya, typically referring to a set of steps leading down to a body of water.