Executive Offices for U.S. Trustees
type: Class
alternative label: 美国托管人执行办公室
subclass of: R0DB70442Cf8b73D9275F14a
hidden label: EOUST
definition: The Executive Office for United States Trustees (EOUST) was created to oversee the United States Trustee Program by providing policy guidance and coordination to United States Trustees, whose duties are set forth in Titles 11 and 28 of the United States Code.