Army & Air Force Exchange Service
type: Class
alternative label: 陆军和空军交流服务
subclass of: RF52f1c417a596A01b36Bcf0
hidden label: AAFES
definition: The Army & Air Force Exchange Service (AAFES, also referred to as The Exchange) is the retailer on U.S. Army and Air Force installations worldwide.