Defense Advanced Research Projects Agency
type: Class
alternative label: 国防高级研究计划局
subclass of: RF52f1c417a596A01b36Bcf0
hidden label: DARPA
definition: The Defense Advanced Research Projects Agency (DARPA) is an agency of the United States Department of Defense responsible for the development of emerging technologies for use by the military.