Philippine languages
type: Class
alternative label: 菲律宾语言
subclass of: RDOvAHsvY8TKJ1O1orXPM9o
definition: Philippine languages refer to the various languages spoken in the Philippines, including Tagalog, Cebuano, Ilocano, and others.