Extortion
type: Class
alternative label: 敲诈勒索
subclass of: RBpSXv8uOXDikW5jk944sRN
definition: To unlawfully obtain money, property, or any other thing of value, either tangible or intangible, through the use or threat of force, misuse of authority, threat of criminal prosecution, threat of destruction of reputation or social standing, or through other coercive means.