Warrant Claim
type: Class
alternative label: 担保索赔
subclass of: R8GqVQ7wf48MBB7IuqjSfOk
definition: A warrant claim refers to a legal assertion involving the issuance, execution, or validity of a warrant, which is an official document issued by a judicial officer that authorizes law enforcement to perform certain acts, such as an arrest, a search, or a seizure. A warrant claim can take many forms, including claims that a warrant was improperly issued, executed, or lacked sufficient cause.