Georgia District Court - Carroll County
type: Class
subclass of: RBxw7BF15bDA0Ifn2vOrC8h
definition: Georgia District Court - Carroll County refers to a specific court within the Georgia District Court system that has jurisdiction over legal matters within Carroll County.