Consumer Credit and Unfair Debt Collection Claims
type: Class
alternative label: 消费者信贷和不当债务收集索赔
subclass of: R8jYAnNATrfoBxAtIKpf72X
definition: Consumer Credit and Unfair Debt Collection Claims refer to legal claims made by individuals against creditors or debt collectors for unfair or deceptive practices in the collection of debts or the provision of credit.