Supply Agreement
type: Class
alternative label: 供应协议
subclass of: R88D8i8AcSTUig2X3yPbFHg
definition: A supply agreement is a legally binding contract between two parties that outlines the terms and conditions for the supply and delivery of goods or services.