L240 Dispositive Motions
type: Class
subclass of: R7jZe5zq22gf2XZO6EWSxuC
definition: A dispositive motion is a legal request made by a party in a case, asking the court to make a final decision on a particular issue or the entire case, before a trial takes place.