Notary Public Officer Liability for Negligent Acknowledgment
type: Class
alternative label: 公证人因疏忽承认而承担责任
subclass of: RGm7jrTspmRi606c5XWZ1z
subclass of: RSRxb9psAJdqf8rppoiYI8
definition: The liability of a notary public officer for negligent acknowledgment refers to the legal responsibility of such an officer for making a mistake or error while performing an acknowledgment, which can result in a malpractice claim or a judicial and procedural tort claim.