Peremptory Challenge of Juror
type: Class
preferred label: Peremptory Strike of Juror
alternative label: 陪审员的挑战权
subclass of: R8aQIG92fCROCjs6BkU82Qf
subclass of: RPs4oGWa0fkJt9wkcTUbnU
definition: The Peremptory Challenge of Juror is the right of a party in a trial to reject a potential juror without stating a reason, as long as the rejection is not based on race or gender.