Credit Account
type: Class
subclass of: RCqg8Edym0NbyFXA5DXor8w
definition: A credit account is a contractual arrangement where a lender extends a line of credit to a borrower. This can be in the form of a credit card account, retail account, or other types of loans. The borrower is obligated to repay the borrowed amount along with any applicable interest and fees.