Motion to Expedite Discovery
type: Class
alternative label: 加速发现动议
subclass of: RBfGu0dj7U3Vhx97y84qzKq
subclass of: RJPmwN3dU0x1Hk5Wgu3Bnx
definition: A Motion to Expedite Discovery is a legal request to speed up the process of obtaining evidence in a case.