Motion to File Complaint
type: Class
alternative label: 提交投诉动议
subclass of: R8xekNn7K6SxToo5ArjIsTX
definition: A Motion to File Complaint is a formal request made to a court to allow a plaintiff to submit a complaint or petition for legal action.