Director’s Liability to Shareholders
type: Class
subclass of: R9JkfZIjkVSa5ud1tJ14w3i
definition: The legal responsibility of a director to act in the best interests of the shareholders of a corporation, and the potential consequences if they fail to do so.